Reaction Details
TargetTyrosine-protein phosphatase non-receptor type 1
LigandBDBM50246745
Substrate/Competitorn/a
Meas. Tech.ChEMBL_557715 (CHEMBL963010)
IC50 150±n/a nM
Citation Zhang, YNZhang, WHong, DShi, LShen, QLi, JYLi, JHu, LH Oleanolic acid and its derivatives: new inhibitor of protein tyrosine phosphatase 1B with cellular activities. Bioorg Med Chem16:8697-705 (2008) 
 
Tyrosine-protein phosphatase non-receptor type 1
Name:Tyrosine-protein phosphatase non-receptor type 1
Type:Protein phosphatase
Mol. Mass.:49963.76
Organism:Homo sapiens (Human)
Description:Human recombinant GST-fusion PTP1B (1-435).
Residue:435
BDBM50246745
NameBDBM50246745
Synonyms:3-(4-Carboxy-benzyloxy)-28-[4-butyric ((S)-1-carboxyphenylethyl)-amide]-Delta12-oleanene | CHEMBL499413
TypeSmall organic molecule
Emp. Form.C51H71NO6
Mol. Mass.794.1125
SMILESCC1(C)CC[C@]2(CCCCC(=O)N[C@@H](Cc3ccccc3)C(O)=O)CC[C@]3(C)C(=CC[C@@H]4[C@@]5(C)CC[C@H](OCc6ccc(cc6)C(O)=O)C(C)(C)[C@@H]5CC[C@@]34C)[C@@H]2C1