Reaction Details
TargetTyrosine-protein phosphatase non-receptor type 1
LigandBDBM50246657
Substrate/Competitorn/a
Meas. Tech.ChEMBL_557715 (CHEMBL963010)
IC50 550±n/a nM
Citation Zhang, YNZhang, WHong, DShi, LShen, QLi, JYLi, JHu, LH Oleanolic acid and its derivatives: new inhibitor of protein tyrosine phosphatase 1B with cellular activities. Bioorg Med Chem16:8697-705 (2008) 
 
Tyrosine-protein phosphatase non-receptor type 1
Name:Tyrosine-protein phosphatase non-receptor type 1
Type:Protein phosphatase
Mol. Mass.:49963.76
Organism:Homo sapiens (Human)
Description:Human recombinant GST-fusion PTP1B (1-435).
Residue:435
BDBM50246657
NameBDBM50246657
Synonyms:(S)-2-(5-((4aR,6aS,6bR,8aR,10S,12aR,12bR,14bR)-10-hydroxy-2,2,6a,6b,9,9,12a-heptamethyl-1,2,3,4,4a,5,6,6a,6b,7,8,8a,9,10,11,12,12a,12b,13,14b-icosahydropicen-4a-yl)pentanamido)-4-(methylthio)butanoic acid | CHEMBL450403
TypeSmall organic molecule
Emp. Form.C39H65NO4S
Mol. Mass.644.003
SMILESCSCC[C@H](NC(=O)CCCC[C@]12CCC(C)(C)C[C@H]1C1=CC[C@@H]3[C@@]4(C)CC[C@H](O)C(C)(C)[C@@H]4CC[C@@]3(C)[C@]1(C)CC2)C(O)=O