Reaction Details
TargetTyrosine-protein phosphatase non-receptor type 2
LigandBDBM50148911
Substrate/Competitorn/a
Meas. Tech.ChEMBL_557716 (CHEMBL963011)
IC50 3330±n/a nM
Citation Zhang, YNZhang, WHong, DShi, LShen, QLi, JYLi, JHu, LH Oleanolic acid and its derivatives: new inhibitor of protein tyrosine phosphatase 1B with cellular activities. Bioorg Med Chem16:8697-705 (2008) 
 
Tyrosine-protein phosphatase non-receptor type 2
Name:Tyrosine-protein phosphatase non-receptor type 2
Type:Protein
Mol. Mass.:48481.80
Organism:Homo sapiens (Human)
Description:P17706
Residue:415
BDBM50148911
NameBDBM50148911
Synonyms:(3beta)-3-hydroxyurs-12-en-28-oic acid CHEMBL169 malol urson
TypeSmall organic molecule
Emp. Form.C30H48O3
Mol. Mass.456.7003
SMILESC[C@@H]1CC[C@@]2(CC[C@]3(C)C(=CC[C@@H]4[C@@]5(C)CC[C@H](O)C(C)(C)[C@@H]5CC[C@@]34C)[C@@H]2[C@H]1C)C(O)=O