Reaction Details
TargetVitamin D3 receptor
LigandBDBM50292704
Substrate/Competitorn/a
Meas. Tech.ChEMBL_510925 (CHEMBL1007259)
IC50 30±n/a nM
Citation Nakabayashi, MYamada, SYoshimoto, NTanaka, TIgarashi, MIkura, TIto, NMakishima, MTokiwa, HDeLuca, HFShimizu, M Crystal structures of rat vitamin D receptor bound to adamantyl vitamin D analogs: structural basis for vitamin D receptor antagonism and partial agonism. J Med Chem51:5320-9 (2008) 
 
Vitamin D3 receptor
Name:Vitamin D3 receptor
Type:Protein
Mol. Mass.:48288.72
Organism:Homo sapiens (Human)
Description:P11473
Residue:427
BDBM50292704
NameBDBM50292704
Synonyms:(1R,3R,7E,17beta)-17-{(1S,2E,5R)-5-hydroxy-1-methyl-6-[(3S,5S,7S)-tricyclo[3.3.1.1~3,7~]dec-1-yl]hex-2-en-1-yl}-2-methylidene-9,10-secoestra-5,7-diene-1,3-diol CHEMBL452878
TypeSmall organic molecule
Emp. Form.C36H54O3
Mol. Mass.534.8122
SMILES[#6]-[#6@@H](\[#6]=[#6]\[#6]-[#6@@H](-[#8])-[#6]C12[#6]-[#6]-3-[#6]-[#6](-[#6]-[#6](-[#6]-3)-[#6]1)-[#6]2)-[#6@H]1-[#6]-[#6]-[#6@H]2\[#6](-[#6]-[#6]-[#6][C@]12[#6])=[#6]\[#6]=[#6]-1/[#6]-[#6@@H](-[#8])-[#6](=[#6])-[#6@H](-[#8])-[#6]-1