Reaction Details
TargetCannabinoid receptor 2
LigandBDBM50253845
Substrate/Competitorn/a
Meas. Tech.ChEMBL_510958 (CHEMBL1003145)
IC50 1206±n/a nM
Citation Tseng, SLHung, MSChang, CPSong, JSTai, CLChiu, HHHsieh, WPLin, YChung, WLKuo, CWWu, CHChu, CMTung, YSChao, YSShia, KS Bioisosteric replacement of the pyrazole 5-aryl moiety of N-(piperidin-1-yl)-5-(4-chlorophenyl)-1-(2,4-dichlorophenyl)-4-methyl-1H-pyrazole-3-carboxamide (SR141716A). A novel series of alkynylthiophenes as potent and selective cannabinoid-1 receptor antagonists. J Med Chem51:5397-412 (2008) 
 
Cannabinoid receptor 2
Name:Cannabinoid receptor 2
Type:G Protein-Coupled Receptor (GPCR)
Mol. Mass.:39690.94
Organism:Homo sapiens (Human)
Description:P34972
Residue:360
BDBM50253845
NameBDBM50253845
Synonyms:1-(2,4-Dichlorophenyl)-4-ethyl-5-(5-(4-methylpent-1-ynyl)thiophen-2-yl)-N-(piperidin-1-yl)-1H-pyrazole-3-carboxamide | CHEMBL517116
TypeSmall organic molecule
Emp. Form.C27H30Cl2N4OS
Mol. Mass.529.524
SMILESCCc1c(nn(c1-c1ccc(s1)C#CCC(C)C)-c1ccc(Cl)cc1Cl)C(=O)NN1CCCCC1