Reaction Details
TargetCannabinoid receptor 1
LigandBDBM50253556
Substrate/Competitorn/a
Meas. Tech.ChEMBL_510957 (CHEMBL1007291)
EC50 390.1±n/a nM
Citation Tseng, SLHung, MSChang, CPSong, JSTai, CLChiu, HHHsieh, WPLin, YChung, WLKuo, CWWu, CHChu, CMTung, YSChao, YSShia, KS Bioisosteric replacement of the pyrazole 5-aryl moiety of N-(piperidin-1-yl)-5-(4-chlorophenyl)-1-(2,4-dichlorophenyl)-4-methyl-1H-pyrazole-3-carboxamide (SR141716A). A novel series of alkynylthiophenes as potent and selective cannabinoid-1 receptor antagonists. J Med Chem51:5397-412 (2008) 
 
Cannabinoid receptor 1
Name:Cannabinoid receptor 1
Type:G Protein-Coupled Receptor (GPCR)
Mol. Mass.:52868.96
Organism:Homo sapiens (Human)
Description:P21554
Residue:472
BDBM50253556
NameBDBM50253556
Synonyms:1-(2,4-Dichlorophenyl)-5-(5-(3-(isopropylamino)prop-1-ynyl)-thiophen-2-yl)-4-methyl-N-(piperidin-1-yl)-1H-pyrazole-3-carboxamide | CHEMBL493068
TypeSmall organic molecule
Emp. Form.C26H29Cl2N5OS
Mol. Mass.530.512
SMILESCC(C)NCC#Cc1ccc(s1)-c1c(C)c(nn1-c1ccc(Cl)cc1Cl)C(=O)NN1CCCCC1