Reaction Details
TargetAurora kinase A
LigandBDBM50264658
Substrate/Competitorn/a
Meas. Tech.ChEMBL_535096 (CHEMBL981688)
IC50>100000±n/a nM
Citation Hughes, TVEmanuel, SLO'Grady, HRConnolly, PJRugg, CFuentes-Pesquera, ARKarnachi, PAlexander, RMiddleton, SA 7-[1H-Indol-2-yl]-2,3-dihydro-isoindol-1-ones as dual Aurora-A/VEGF-R2 kinase inhibitors: design, synthesis, and biological activity. Bioorg Med Chem Lett18:5130-3 (2008) 
 
Aurora kinase A
Name:Aurora kinase A
Type:Serine/threonine-protein kinase
Mol. Mass.:45830.98
Organism:Homo sapiens (Human)
Description:O14965
Residue:403
BDBM50264658
NameBDBM50264658
Synonyms:CHEMBL473040 | methyl 3-oxoisoindoline-4-carboxylate
TypeSmall organic molecule
Emp. Form.C10H9NO3
Mol. Mass.191.1834
SMILESCOC(=O)c1cccc2CNC(=O)c12