Reaction Details
TargetVascular endothelial growth factor receptor 2
LigandBDBM50264579
Substrate/Competitorn/a
Meas. Tech.ChEMBL_535095 (CHEMBL981687)
IC50 74±n/a nM
Citation Hughes, TVEmanuel, SLO'Grady, HRConnolly, PJRugg, CFuentes-Pesquera, ARKarnachi, PAlexander, RMiddleton, SA 7-[1H-Indol-2-yl]-2,3-dihydro-isoindol-1-ones as dual Aurora-A/VEGF-R2 kinase inhibitors: design, synthesis, and biological activity. Bioorg Med Chem Lett18:5130-3 (2008) 
 
Vascular endothelial growth factor receptor 2
Name:Vascular endothelial growth factor receptor 2
Type:Receptor Tyrosine Kinase
Mol. Mass.:151510.97
Organism:Homo sapiens (Human)
Description:P35968
Residue:1356
BDBM50264579
NameBDBM50264579
Synonyms:7-(5-(2-morpholinoethoxy)-1H-indol-2-yl)isoindolin-1-one | CHEMBL483451
TypeSmall organic molecule
Emp. Form.C22H23N3O3
Mol. Mass.377.4363
SMILESO=C1NCc2cccc(-c3cc4cc(OCCN5CCOCC5)ccc4[nH]3)c12