Reaction Details
TargetAurora kinase A
LigandBDBM50264613
Substrate/Competitorn/a
Meas. Tech.ChEMBL_535096 (CHEMBL981688)
IC50 21230±n/a nM
Citation Hughes, TVEmanuel, SLO'Grady, HRConnolly, PJRugg, CFuentes-Pesquera, ARKarnachi, PAlexander, RMiddleton, SA 7-[1H-Indol-2-yl]-2,3-dihydro-isoindol-1-ones as dual Aurora-A/VEGF-R2 kinase inhibitors: design, synthesis, and biological activity. Bioorg Med Chem Lett18:5130-3 (2008) 
 
Aurora kinase A
Name:Aurora kinase A
Type:Serine/threonine-protein kinase
Mol. Mass.:45830.98
Organism:Homo sapiens (Human)
Description:O14965
Residue:403
BDBM50264613
NameBDBM50264613
Synonyms:7-(5-(benzyloxy)-1H-indol-2-yl)isoindolin-1-one | CHEMBL484678
TypeSmall organic molecule
Emp. Form.C23H18N2O2
Mol. Mass.354.4012
SMILESO=C1NCc2cccc(-c3cc4cc(OCc5ccccc5)ccc4[nH]3)c12