Reaction Details
TargetAurora kinase A
LigandBDBM50264612
Substrate/Competitorn/a
Meas. Tech.ChEMBL_535096 (CHEMBL981688)
IC50 100±n/a nM
Citation Hughes, TVEmanuel, SLO'Grady, HRConnolly, PJRugg, CFuentes-Pesquera, ARKarnachi, PAlexander, RMiddleton, SA 7-[1H-Indol-2-yl]-2,3-dihydro-isoindol-1-ones as dual Aurora-A/VEGF-R2 kinase inhibitors: design, synthesis, and biological activity. Bioorg Med Chem Lett18:5130-3 (2008) 
 
Aurora kinase A
Name:Aurora kinase A
Type:Serine/threonine-protein kinase
Mol. Mass.:45830.98
Organism:Homo sapiens (Human)
Description:O14965
Residue:403
BDBM50264612
NameBDBM50264612
Synonyms:7-(1H-indol-2-yl)isoindolin-1-one | CHEMBL482621
TypeSmall organic molecule
Emp. Form.C16H12N2O
Mol. Mass.248.2793
SMILESO=C1NCc2cccc(-c3cc4ccccc4[nH]3)c12