Reaction Details
TargetAminopeptidase N
LigandBDBM50253922
Substrate/Competitorn/a
Meas. Tech.ChEMBL_511264 (CHEMBL996090)
IC50 38400±n/a nM
Citation Cheng, XCWang, QFang, HTang, WXu, WF Synthesis of new sulfonyl pyrrolidine derivatives as matrix metalloproteinase inhibitors. Bioorg Med Chem16:7932-8 (2008) 
 
Aminopeptidase N
Name:Aminopeptidase N
Type:PROTEIN
Mol. Mass.:109522.63
Organism:Homo sapiens (Human)
Description:ChEMBL_1507526
Residue:967
BDBM50253922
NameBDBM50253922
Synonyms:4-Hydroxy-1-(toluene-4-sulfonyl)-pyrrolidine-2-carboxylicacid methyl ester trans-4-Hydroxy-1-(toluene-4-sulfonyl)-pyrrolidine-2-carboxylic acid methyl ester
TypeSmall organic molecule
Emp. Form.C13H17NO5S
Mol. Mass.299.343
SMILESCOC(=O)[C@@H]1C[C@@H](O)CN1S(=O)(=O)c1ccc(C)cc1