Reaction Details
TargetB1 bradykinin receptor
LigandBDBM50265333
Substrate/Competitorn/a
Meas. Tech.ChEMBL_492574 (CHEMBL952241)
Ki 0.8±n/a nM
Citation Kuduk, SDChang, RKDipardo, RMDi Marco, CNMurphy, KLRansom, RWReiss, DRTang, CPrueksaritanont, TPettibone, DJBock, MG Bradykinin B1 receptor antagonists: an alpha-hydroxy amide with an improved metabolism profile. Bioorg Med Chem Lett18:5107-10 (2008) 
 
B1 bradykinin receptor
Name:B1 bradykinin receptor
Type:Enzyme
Mol. Mass.:40508.87
Organism:Homo sapiens (Human)
Description:P46663
Residue:353
BDBM50265333
NameBDBM50265333
Synonyms:(R)-N-((R)-1-(5-(5-chloro-3-fluoro-2-(5-(hydroxymethyl)-1,2,4-oxadiazol-3-yl)phenyl)-3-fluoropyridin-2-yl)ethyl)-3,3,3-trifluoro-2-hydroxy-2-methylpropanamide | CHEMBL496529
TypeSmall organic molecule
Emp. Form.C20H16ClF5N4O4
Mol. Mass.506.81
SMILESC[C@@H](NC(=O)[C@@](C)(O)C(F)(F)F)c1ncc(cc1F)-c1cc(Cl)cc(F)c1-c1noc(CO)n1