Reaction Details
TargetGrowth hormone secretagogue receptor type 1
LigandBDBM50264486
Substrate/Competitorn/a
Meas. Tech.ChEMBL_535178 (CHEMBL988117)
Ki 260±n/a nM
Citation Zhai, WFlynn, NLonghi, DATino, JAMurphy, BJSlusarchyk, DGordon, DAPendri, AShi, SStoffel, RMa, BSofia, MJGerritz, SW Discovery and optimization of (R)-prolinol-derived agonists of the Growth Hormone Secretagogue receptor (GHSR). Bioorg Med Chem Lett18:5083-6 (2008) 
 
Growth hormone secretagogue receptor type 1
Name:Growth hormone secretagogue receptor type 1
Type:Receptor
Mol. Mass.:41334.57
Organism:Homo sapiens (Human)
Description:Receptor binding studies use plasma membranes from LLC PK-1 cells transiently transfected with hGHSR1a.
Residue:366
BDBM50264486
NameBDBM50264486
Synonyms:CHEMBL489401 | N-(4-acetamidophenyl)-2-(3-chlorophenoxy)-N-((R)-pyrrolidin-2-ylmethyl)propanamide
TypeSmall organic molecule
Emp. Form.C22H26ClN3O3
Mol. Mass.415.913
SMILESCC(Oc1cccc(Cl)c1)C(=O)N(C[C@H]1CCCN1)c1ccc(NC(C)=O)cc1