Reaction Details
TargetCannabinoid receptor 1
LigandBDBM50247147
Substrate/Competitorn/a
Meas. Tech.ChEMBL_557771 (CHEMBL953280)
Ki 8.9±n/a nM
Citation Yao, FLi, CVadivel, SKBowman, ALMakriyannis, A Development of novel tail-modified anandamide analogs. Bioorg Med Chem Lett18:5912-5 (2008) 
 
Cannabinoid receptor 1
Name:Cannabinoid receptor 1
Type:G Protein-Coupled Receptor (GPCR)
Mol. Mass.:52856.55
Organism:Rattus norvegicus (rat)
Description:P20272
Residue:473
BDBM50247147
NameBDBM50247147
Synonyms:(R,5Z,8Z,11Z,14Z)-19-(4-bromophenyl)-N-(1-hydroxypropan-2-yl)nonadeca-5,8,11,14-tetraenamide | CHEMBL473515
TypeSmall organic molecule
Emp. Form.C28H40BrNO2
Mol. Mass.502.527
SMILESC[C@H](CO)NC(=O)CCC\C=C/C\C=C/C\C=C/C\C=C/CCCCc1ccc(Br)cc1