Reaction Details
TargetIntegrin alpha-IIb
LigandBDBM50253900
Substrate/Competitorn/a
Meas. Tech.ChEMBL_511534 (CHEMBL980977)
IC50 11300±n/a nM
Citation Ilas, JJakopin, ZBorstnar, TStegnar, MKikelj, D 3,4-Dihydro-2H-1,4-benzoxazine derivatives combining thrombin inhibitory and glycoprotein IIb/IIIa receptor antagonistic activity as a novel class of antithrombotic compounds with dual function. J Med Chem51:5617-29 (2008) 
 
Integrin alpha-IIb
Name:Integrin alpha-IIb
Type:Protein
Mol. Mass.:113354.85
Organism:Homo sapiens (Human)
Description:P08514
Residue:1039
BDBM50253900
NameBDBM50253900
Synonyms:CHEMBL468464 | Ethyl 4-({2-[(4-carbamimidoylphenoxy)methyl]-2,4-dimethyl-3,4-dihydro-2H-1,4-benzoxazin-7-yl}(pyridin-2-ylmethyl)amino)-4-oxobutanoate acetate
TypeSmall organic molecule
Emp. Form.C30H35N5O5
Mol. Mass.545.6294
SMILESCCOC(=O)CCC(=O)N(Cc1ccccn1)c1ccc2N(C)CC(C)(COc3ccc(cc3)C(N)=N)Oc2c1