Reaction Details
TargetIntegrin alpha-IIb
LigandBDBM50253716
Substrate/Competitorn/a
Meas. Tech.ChEMBL_511534 (CHEMBL980977)
IC50 1640±n/a nM
Citation Ilas, JJakopin, ZBorstnar, TStegnar, MKikelj, D 3,4-Dihydro-2H-1,4-benzoxazine derivatives combining thrombin inhibitory and glycoprotein IIb/IIIa receptor antagonistic activity as a novel class of antithrombotic compounds with dual function. J Med Chem51:5617-29 (2008) 
 
Integrin alpha-IIb
Name:Integrin alpha-IIb
Type:Protein
Mol. Mass.:113354.85
Organism:Homo sapiens (Human)
Description:P08514
Residue:1039
BDBM50253716
NameBDBM50253716
Synonyms:(S)-3-{[2-(4-Carbamimidoyl-benzyloxy)-4-methyl-3-oxo-3,4-dihydro-2H-benzo[1,4]oxazine-7-carbonyl]-amino}-3-phenyl-propionic acid | CHEMBL462037
TypeSmall organic molecule
Emp. Form.C27H26N4O6
Mol. Mass.502.5185
SMILESCN1C(=O)C(OCc2ccc(cc2)C(N)=N)Oc2cc(ccc12)C(=O)N[C@@H](CC(O)=O)c1ccccc1