Reaction Details
TargetCannabinoid receptor 1
LigandBDBM50247086
Substrate/Competitorn/a
Meas. Tech.ChEMBL_557789 (CHEMBL953298)
IC50 10±n/a nM
Citation Nomura, DKHudak, CSWard, AMBurston, JJIssa, RSFisher, KJAbood, MEWiley, JLLichtman, AHCasida, JE Monoacylglycerol lipase regulates 2-arachidonoylglycerol action and arachidonic acid levels. Bioorg Med Chem Lett18:5875-8 (2008) 
 
Cannabinoid receptor 1
Name:Cannabinoid receptor 1
Type:Enzyme
Mol. Mass.:52842.52
Organism:Mus musculus (Mouse)
Description:P47746
Residue:473
BDBM50247086
NameBDBM50247086
Synonyms:CHEMBL444970 diethyl 3,5,6-trichloropyridin-2-yl phosphate
TypeSmall organic molecule
Emp. Form.C9H11Cl3NO4P
Mol. Mass.334.521
SMILESCCOP(=O)(OCC)Oc1nc(Cl)c(Cl)cc1Cl