Reaction Details
TargetMonoglyceride lipase
LigandBDBM50240416
Substrate/Competitorn/a
Meas. Tech.ChEMBL_557786 (CHEMBL953295)
IC50 2300±n/a nM
Citation Nomura, DKHudak, CSWard, AMBurston, JJIssa, RSFisher, KJAbood, MEWiley, JLLichtman, AHCasida, JE Monoacylglycerol lipase regulates 2-arachidonoylglycerol action and arachidonic acid levels. Bioorg Med Chem Lett18:5875-8 (2008) 
 
Monoglyceride lipase
Name:Monoglyceride lipase
Type:Hydrolase
Mol. Mass.:33391.67
Organism:Mus musculus (mouse)
Description:Assays were using membranes of recombinant MAG Lipase transiently transfected in COS-7 cells.
Residue:303
BDBM50240416
NameBDBM50240416
Synonyms:CHEMBL23838 diethyl 4-nitrophenyl phosphate diethyl paraoxon p-nitrophenyl diethyl phosphate phosphacol | phosphoric acid diethyl 4-nitrophenyl ester
TypeSmall organic molecule
Emp. Form.C10H14NO6P
Mol. Mass.275.195
SMILESCCOP(=O)(OCC)Oc1ccc(cc1)[N+]([O-])=O