Reaction Details
TargetCannabinoid receptor 1
LigandBDBM50240416
Substrate/Competitorn/a
Meas. Tech.ChEMBL_557789 (CHEMBL953298)
IC50 1200±n/a nM
Citation Nomura, DKHudak, CSWard, AMBurston, JJIssa, RSFisher, KJAbood, MEWiley, JLLichtman, AHCasida, JE Monoacylglycerol lipase regulates 2-arachidonoylglycerol action and arachidonic acid levels. Bioorg Med Chem Lett18:5875-8 (2008) 
 
Cannabinoid receptor 1
Name:Cannabinoid receptor 1
Type:Enzyme
Mol. Mass.:52842.52
Organism:Mus musculus (Mouse)
Description:P47746
Residue:473
BDBM50240416
NameBDBM50240416
Synonyms:CHEMBL23838 diethyl 4-nitrophenyl phosphate diethyl paraoxon p-nitrophenyl diethyl phosphate phosphacol | phosphoric acid diethyl 4-nitrophenyl ester
TypeSmall organic molecule
Emp. Form.C10H14NO6P
Mol. Mass.275.195
SMILESCCOP(=O)(OCC)Oc1ccc(cc1)[N+]([O-])=O