Reaction Details
TargetMonoglyceride lipase
LigandBDBM50132715
Substrate/Competitorn/a
Meas. Tech.ChEMBL_557786 (CHEMBL953295)
IC50 200±n/a nM
Citation Nomura, DKHudak, CSWard, AMBurston, JJIssa, RSFisher, KJAbood, MEWiley, JLLichtman, AHCasida, JE Monoacylglycerol lipase regulates 2-arachidonoylglycerol action and arachidonic acid levels. Bioorg Med Chem Lett18:5875-8 (2008) 
 
Monoglyceride lipase
Name:Monoglyceride lipase
Type:Hydrolase
Mol. Mass.:33391.67
Organism:Mus musculus (mouse)
Description:Assays were using membranes of recombinant MAG Lipase transiently transfected in COS-7 cells.
Residue:303
BDBM50132715
NameBDBM50132715
Synonyms:CHEMBL97038 dodecane-1-sulfonyl fluoride
TypeSmall organic molecule
Emp. Form.C12H25FO2S
Mol. Mass.252.389
SMILESCCCCCCCCCCCCS(F)(=O)=O