Reaction Details
TargetMonoglyceride lipase
LigandBDBM50247048
Substrate/Competitorn/a
Meas. Tech.ChEMBL_557786 (CHEMBL953295)
IC50 2.2±n/a nM
Citation Nomura, DKHudak, CSWard, AMBurston, JJIssa, RSFisher, KJAbood, MEWiley, JLLichtman, AHCasida, JE Monoacylglycerol lipase regulates 2-arachidonoylglycerol action and arachidonic acid levels. Bioorg Med Chem Lett18:5875-8 (2008) 
 
Monoglyceride lipase
Name:Monoglyceride lipase
Type:Hydrolase
Mol. Mass.:33391.67
Organism:Mus musculus (mouse)
Description:Assays were using membranes of recombinant MAG Lipase transiently transfected in COS-7 cells.
Residue:303
BDBM50247048
NameBDBM50247048
Synonyms:CHEMBL462609 | methyl icosylphosphonofluoridate
TypeSmall organic molecule
Emp. Form.C21H44FO2P
Mol. Mass.378.545
(F)(=O)OC