Reaction Details
TargetFatty-acid amide hydrolase 1
LigandBDBM50247048
Substrate/Competitorn/a
Meas. Tech.ChEMBL_557788 (CHEMBL953297)
IC50 0.1±n/a nM
Citation Nomura, DKHudak, CSWard, AMBurston, JJIssa, RSFisher, KJAbood, MEWiley, JLLichtman, AHCasida, JE Monoacylglycerol lipase regulates 2-arachidonoylglycerol action and arachidonic acid levels. Bioorg Med Chem Lett18:5875-8 (2008) 
 
Fatty-acid amide hydrolase 1
Name:Fatty-acid amide hydrolase 1
Type:Hydrolase; single-pass membrane protein; homodimer
Mol. Mass.:63227.28
Organism:Mus musculus (mouse)
Description:Mouse brain membranes were used in the assay.
Residue:579
BDBM50247048
NameBDBM50247048
Synonyms:CHEMBL462609 | methyl icosylphosphonofluoridate
TypeSmall organic molecule
Emp. Form.C21H44FO2P
Mol. Mass.378.545
(F)(=O)OC