Reaction Details
TargetB1 bradykinin receptor
LigandBDBM50264370
Substrate/Competitorn/a
Meas. Tech.ChEMBL_535281 (CHEMBL982606)
IC50 23±n/a nM
Citation Guo, QChandrasekhar, JIhle, DWustrow, DJChenard, BLKrause, JEHutchison, AAlderman, DCheng, CCortright, DBroom, DKershaw, MTSimmermacher-Mayer, JPeng, YHodgetts, KJ 1-Benzylbenzimidazoles: the discovery of a novel series of bradykinin B(1) receptor antagonists. Bioorg Med Chem Lett18:5027-31 (2008) 
 
B1 bradykinin receptor
Name:B1 bradykinin receptor
Type:Enzyme Catalytic Domain
Mol. Mass.:38389.97
Organism:RAT
Description:B1 BRADYKININ BDKRB1 RAT::P97583
Residue:337
BDBM50264370
NameBDBM50264370
Synonyms:1-benzyl-N-(2-(4-(1-methylpiperidin-4-yl)piperazin-1-yl)-2-oxoethyl)-N-propyl-1H-benzo[d]imidazole-2-carboxamide | CHEMBL490619
TypeSmall organic molecule
Emp. Form.C30H40N6O2
Mol. Mass.516.6776
SMILESCCCN(CC(=O)N1CCN(CC1)C1CCN(C)CC1)C(=O)c1nc2ccccc2n1Cc1ccccc1