Reaction Details
TargetB1 bradykinin receptor
LigandBDBM50264369
Substrate/Competitorn/a
Meas. Tech.ChEMBL_535281 (CHEMBL982606)
IC50 396±n/a nM
Citation Guo, QChandrasekhar, JIhle, DWustrow, DJChenard, BLKrause, JEHutchison, AAlderman, DCheng, CCortright, DBroom, DKershaw, MTSimmermacher-Mayer, JPeng, YHodgetts, KJ 1-Benzylbenzimidazoles: the discovery of a novel series of bradykinin B(1) receptor antagonists. Bioorg Med Chem Lett18:5027-31 (2008) 
 
B1 bradykinin receptor
Name:B1 bradykinin receptor
Type:Enzyme Catalytic Domain
Mol. Mass.:38389.97
Organism:RAT
Description:B1 BRADYKININ BDKRB1 RAT::P97583
Residue:337
BDBM50264369
NameBDBM50264369
Synonyms:1-benzyl-N-(2-oxo-2-(4-(pyridin-4-yl)piperazin-1-yl)ethyl)-N-propyl-1H-benzo[d]imidazole-2-carboxamide | CHEMBL490618
TypeSmall organic molecule
Emp. Form.C29H32N6O2
Mol. Mass.496.6034
SMILESCCCN(CC(=O)N1CCN(CC1)c1ccncc1)C(=O)c1nc2ccccc2n1Cc1ccccc1