Reaction Details
TargetHistamine H3 receptor
LigandBDBM50264932
Substrate/Competitorn/a
Meas. Tech.ChEMBL_496461 (CHEMBL1004592)
Ki 2±n/a nM
Citation Aslanian, RZhu, XVaccaro, HAShih, NYPiwinski, JJWilliams, SMWest, RE Benzimidazole-substituted (3-phenoxypropyl)amines as histamine H3 receptor ligands. Bioorg Med Chem Lett18:5032-6 (2008) 
 
Histamine H3 receptor
Name:Histamine H3 receptor
Type:G Protein-Coupled Receptor (GPCR)
Mol. Mass.:48691.47
Organism:Homo sapiens (Human)
Description:Binding assays were using CHO cells stably expressing hH3R receptors.
Residue:445
BDBM50264932
NameBDBM50264932
Synonyms:1-(4-(3-(4-benzylpiperidin-1-yl)propoxy)phenyl)-5-fluoro-2-(pyridin-2-yl)-1H-benzo[d]imidazole | CHEMBL500637
TypeSmall organic molecule
Emp. Form.C33H33FN4O
Mol. Mass.520.6397
SMILESFc1ccc2n(c(nc2c1)-c1ccccn1)-c1ccc(OCCCN2CCC(Cc3ccccc3)CC2)cc1