Reaction Details
TargetHistamine H3 receptor
LigandBDBM50264895
Substrate/Competitorn/a
Meas. Tech.ChEMBL_496463 (CHEMBL1004594)
Ki 1.8±n/a nM
Citation Aslanian, RZhu, XVaccaro, HAShih, NYPiwinski, JJWilliams, SMWest, RE Benzimidazole-substituted (3-phenoxypropyl)amines as histamine H3 receptor ligands. Bioorg Med Chem Lett18:5032-6 (2008) 
 
Histamine H3 receptor
Name:Histamine H3 receptor
Type:PROTEIN
Mol. Mass.:48560.37
Organism:Mus musculus
Description:ChEMBL_988451
Residue:445
BDBM50264895
NameBDBM50264895
Synonyms:5-fluoro-1-(4-(3-(piperidin-1-yl)propoxy)phenyl)-2-(pyridin-2-yl)-1H-benzo[d]imidazole | CHEMBL495698
TypeSmall organic molecule
Emp. Form.C26H27FN4O
Mol. Mass.430.5172
SMILESFc1ccc2n(c(nc2c1)-c1ccccn1)-c1ccc(OCCCN2CCCCC2)cc1