Reaction Details
TargetProstaglandin G/H synthase 2
LigandBDBM50253602
Substrate/Competitorn/a
Meas. Tech.ChEMBL_511538 (CHEMBL980981)
IC50 140±n/a nM
Citation Biava, MPorretta, GCPoce, GSupino, SManetti, FForli, SBotta, MSautebin, LRossi, APergola, CGhelardini, CNorcini, MMakovec, FGiordani, AAnzellotti, PCirilli, RFerretti, RGallinella, BLa Torre, FAnzini, MPatrignani, P Synthesis, in vitro, and in vivo biological evaluation and molecular docking simulations of chiral alcohol and ether derivatives of the 1,5-diarylpyrrole scaffold as novel anti-inflammatory and analgesic agents. Bioorg Med Chem16:8072-81 (2008) 
 
Prostaglandin G/H synthase 2
Name:Prostaglandin G/H synthase 2
Type:Protein
Mol. Mass.:69020.39
Organism:Mus musculus (Mouse)
Description:Q05769
Residue:604
BDBM50253602
NameBDBM50253602
Synonyms:(+)-(S)-Ethyl-[2-ethoxy-2-[1-(4-methoxy)phenyl-2-methyl-5-(4-methylsulfonyl)phenyl-1H-pyrrol-3-yl]]acetate | CHEMBL493497
TypeSmall organic molecule
Emp. Form.C25H29NO6S
Mol. Mass.471.566
SMILESCCO[C@H](C(=O)OCC)c1cc(-c2ccc(cc2)S(C)(=O)=O)n(c1C)-c1ccc(OC)cc1