Reaction Details
TargetCannabinoid receptor 1
LigandBDBM50253826
Substrate/Competitorn/a
Meas. Tech.ChEMBL_512499 (CHEMBL966989)
Ki 0.5±n/a nM
Citation Donohue, SRPike, VWFinnema, SJTruong, PAndersson, JGulyás, BHalldin, C Discovery and labeling of high-affinity 3,4-diarylpyrazolines as candidate radioligands for in vivo imaging of cannabinoid subtype-1 (CB1) receptors. J Med Chem51:5608-16 (2008) 
 
Cannabinoid receptor 1
Name:Cannabinoid receptor 1
Type:G Protein-Coupled Receptor (GPCR)
Mol. Mass.:52868.96
Organism:Homo sapiens (Human)
Description:P21554
Residue:472
BDBM50253826
NameBDBM50253826
Synonyms:(-)-3-(4-Chlorophenyl)-N'-[(4-cyanophenyl)sulfonyl]-4-phenyl-4,5-dihydro-1H-pyrazole-1-carboxamidine | CHEMBL459730
TypeSmall organic molecule
Emp. Form.C23H18ClN5O2S
Mol. Mass.463.939
SMILESClc1ccc(cc1)C1=NN(C[C@@H]1c1ccccc1)C(=N)NS(=O)(=O)c1ccc(cc1)C#N