Reaction Details
TargetSodium/glucose cotransporter 2
LigandBDBM50265233
Substrate/Competitorn/a
Meas. Tech.ChEMBL_496716 (CHEMBL1005353)
IC50 122±n/a nM
Citation Lansdell, MIBurring, DJHepworth, DStrawbridge, MGraham, EGuyot, TBetson, MSHart, JD Design and synthesis of fluorescent SGLT2 inhibitors. Bioorg Med Chem Lett18:4944-7 (2008) 
 
Sodium/glucose cotransporter 2
Name:Sodium/glucose cotransporter 2
Type:Protein
Mol. Mass.:72902.00
Organism:Homo sapiens (Human)
Description:P31639
Residue:672
BDBM50265233
NameBDBM50265233
Synonyms:24-[({4-[4-({2-chloro-5-[(2S,3R,4R,5S,6R)-3,4,5-trihydroxy-6-(hydroxymethyl)oxan-2-yl]phenyl}methyl)phenoxy]butyl}(methyl)carbamoyl)methyl]-5,5,27,27-tetramethyl-16-oxa-12,20-diazaheptacyclo[15.11.0.0^{3,15}.0^{4,12}.0^{6,11}.0^{20,28}.0^{21,26}]octacosa-1(28),2,4(12),6(11),7,9,21(26),22,24-nonaen-12-ylium-8-sulfonate | CHEMBL499912
TypeSmall organic molecule
Emp. Form.C55H62ClN3O11S
Mol. Mass.1008.612
SMILESCN(CCCCOc1ccc(Cc2cc(ccc2Cl)[C@@H]2O[C@H](CO)[C@@H](O)[C@H](O)[C@H]2O)cc1)C(=O)Cc1ccc2N3CCC4OC5CC[N+]6=C(C5=CC4=C3C(C)(C)c2c1)C(C)(C)c1cc(ccc61)S([O-])(=O)=O