Reaction Details
TargetSodium/glucose cotransporter 2
LigandBDBM50265178
Substrate/Competitorn/a
Meas. Tech.ChEMBL_496716 (CHEMBL1005353)
IC50 45±n/a nM
Citation Lansdell, MIBurring, DJHepworth, DStrawbridge, MGraham, EGuyot, TBetson, MSHart, JD Design and synthesis of fluorescent SGLT2 inhibitors. Bioorg Med Chem Lett18:4944-7 (2008) 
 
Sodium/glucose cotransporter 2
Name:Sodium/glucose cotransporter 2
Type:Protein
Mol. Mass.:72902.00
Organism:Homo sapiens (Human)
Description:P31639
Residue:672
BDBM50265178
NameBDBM50265178
Synonyms:CHEMBL521565 | N-(4-(2-chloro-5-((2S,3R,4R,5S,6R)-3,4,5-trihydroxy-6-(hydroxymethyl)tetrahydro-2H-pyran-2-yl)benzyl)benzyl)-N-methylbenzamide
TypeSmall organic molecule
Emp. Form.C28H30ClNO6
Mol. Mass.511.994
SMILESCN(Cc1ccc(Cc2cc(ccc2Cl)[C@@H]2O[C@H](CO)[C@@H](O)[C@H](O)[C@H]2O)cc1)C(=O)c1ccccc1