Reaction Details
TargetMitogen-activated protein kinase kinase kinase 8
LigandBDBM50265310
Substrate/Competitorn/a
Meas. Tech.ChEMBL_496717 (CHEMBL1005354)
IC50 1600±n/a nM
Citation George, DFriedman, MAllen, HArgiriadi, MBarberis, CBischoff, AClabbers, ACusack, KDixon, RFix-Stenzel, SGordon, TJanssen, BJia, YMoskey, MQuinn, CSalmeron, JAWishart, NWoller, KYu, Z Discovery of thieno[2,3-c]pyridines as potent COT inhibitors. Bioorg Med Chem Lett18:4952-5 (2008) 
 
Mitogen-activated protein kinase kinase kinase 8
Name:Mitogen-activated protein kinase kinase kinase 8
Type:Serine/threonine-protein kinase
Mol. Mass.:52916.89
Organism:Homo sapiens (Human)
Description:P41279
Residue:467
BDBM50265310
NameBDBM50265310
Synonyms:4-(4-bromophenoxy)-2-(2H-tetrazol-5-yl)thieno[2,3-c]pyridine | CHEMBL498599
TypeSmall organic molecule
Emp. Form.C14H8BrN5OS
Mol. Mass.374.215
SMILESBrc1ccc(Oc2cncc3sc(cc23)-c2nnn[nH]2)cc1