Reaction Details
TargetMitogen-activated protein kinase kinase kinase 8
LigandBDBM50265312
Substrate/Competitorn/a
Meas. Tech.ChEMBL_496717 (CHEMBL1005354)
IC50 610±n/a nM
Citation George, DFriedman, MAllen, HArgiriadi, MBarberis, CBischoff, AClabbers, ACusack, KDixon, RFix-Stenzel, SGordon, TJanssen, BJia, YMoskey, MQuinn, CSalmeron, JAWishart, NWoller, KYu, Z Discovery of thieno[2,3-c]pyridines as potent COT inhibitors. Bioorg Med Chem Lett18:4952-5 (2008) 
 
Mitogen-activated protein kinase kinase kinase 8
Name:Mitogen-activated protein kinase kinase kinase 8
Type:Serine/threonine-protein kinase
Mol. Mass.:52916.89
Organism:Homo sapiens (Human)
Description:P41279
Residue:467
BDBM50265312
NameBDBM50265312
Synonyms:4-(4-tert-butylphenoxy)-2-(2H-tetrazol-5-yl)thieno[2,3-c]pyridine | CHEMBL539169
TypeSmall organic molecule
Emp. Form.C18H17N5OS
Mol. Mass.351.425
SMILESCC(C)(C)c1ccc(Oc2cncc3sc(cc23)-c2nnn[nH]2)cc1