Reaction Details
TargetMitogen-activated protein kinase kinase kinase 8
LigandBDBM50264739
Substrate/Competitorn/a
Meas. Tech.ChEMBL_496717 (CHEMBL1005354)
IC50 120±n/a nM
Citation George, DFriedman, MAllen, HArgiriadi, MBarberis, CBischoff, AClabbers, ACusack, KDixon, RFix-Stenzel, SGordon, TJanssen, BJia, YMoskey, MQuinn, CSalmeron, JAWishart, NWoller, KYu, Z Discovery of thieno[2,3-c]pyridines as potent COT inhibitors. Bioorg Med Chem Lett18:4952-5 (2008) 
 
Mitogen-activated protein kinase kinase kinase 8
Name:Mitogen-activated protein kinase kinase kinase 8
Type:Serine/threonine-protein kinase
Mol. Mass.:52916.89
Organism:Homo sapiens (Human)
Description:P41279
Residue:467
BDBM50264739
NameBDBM50264739
Synonyms:4-(3'-chlorobiphenyl-4-yloxy)-2-(2H-tetrazol-5-yl)thieno[2,3-c]pyridine | CHEMBL522129
TypeSmall organic molecule
Emp. Form.C20H12ClN5OS
Mol. Mass.405.86
SMILESClc1cccc(c1)-c1ccc(Oc2cncc3sc(cc23)-c2nnn[nH]2)cc1