Reaction Details
TargetMitogen-activated protein kinase kinase kinase 8
LigandBDBM50264741
Substrate/Competitorn/a
Meas. Tech.ChEMBL_496717 (CHEMBL1005354)
IC50 230±n/a nM
Citation George, DFriedman, MAllen, HArgiriadi, MBarberis, CBischoff, AClabbers, ACusack, KDixon, RFix-Stenzel, SGordon, TJanssen, BJia, YMoskey, MQuinn, CSalmeron, JAWishart, NWoller, KYu, Z Discovery of thieno[2,3-c]pyridines as potent COT inhibitors. Bioorg Med Chem Lett18:4952-5 (2008) 
 
Mitogen-activated protein kinase kinase kinase 8
Name:Mitogen-activated protein kinase kinase kinase 8
Type:Serine/threonine-protein kinase
Mol. Mass.:52916.89
Organism:Homo sapiens (Human)
Description:P41279
Residue:467
BDBM50264741
NameBDBM50264741
Synonyms:4'-(2-(2H-tetrazol-5-yl)thieno[2,3-c]pyridin-4-yloxy)biphenyl-4-amine | CHEMBL491635
TypeSmall organic molecule
Emp. Form.C20H14N6OS
Mol. Mass.386.43
SMILESNc1ccc(cc1)-c1ccc(Oc2cncc3sc(cc23)-c2nnn[nH]2)cc1