Reaction Details
TargetDual specificity mitogen-activated protein kinase kinase 1
LigandBDBM28042
Substrate/Competitorn/a
Meas. Tech.ChEMBL_496718 (CHEMBL1005355)
IC50 9700±n/a nM
Citation George, DFriedman, MAllen, HArgiriadi, MBarberis, CBischoff, AClabbers, ACusack, KDixon, RFix-Stenzel, SGordon, TJanssen, BJia, YMoskey, MQuinn, CSalmeron, JAWishart, NWoller, KYu, Z Discovery of thieno[2,3-c]pyridines as potent COT inhibitors. Bioorg Med Chem Lett18:4952-5 (2008) 
 
Dual specificity mitogen-activated protein kinase kinase 1
Name:Dual specificity mitogen-activated protein kinase kinase 1
Type:Other Protein Type
Mol. Mass.:43439.03
Organism:Homo sapiens (Human)
Description:Full-length human MEK-1 was generated by PCR and purified as a fusion protein from Escherichia coli lysates.
Residue:393
BDBM28042
NameBDBM28042
Synonyms:5-[4-(4-phenylphenoxy)thieno[2,3-c]pyridin-2-yl]-1H-1,2,3,4-tetrazole thieno[2,3-c]pyridine, 7
TypeSmall organic molecule
Emp. Form.C20H13N5OS
Mol. Mass.371.415
SMILESO(c1ccc(cc1)-c1ccccc1)c1cncc2sc(cc12)-c1nnn[nH]1