Reaction Details
TargetDual specificity mitogen-activated protein kinase kinase 1
LigandBDBM50264738
Substrate/Competitorn/a
Meas. Tech.ChEMBL_496718 (CHEMBL1005355)
IC50 1500±n/a nM
Citation George, DFriedman, MAllen, HArgiriadi, MBarberis, CBischoff, AClabbers, ACusack, KDixon, RFix-Stenzel, SGordon, TJanssen, BJia, YMoskey, MQuinn, CSalmeron, JAWishart, NWoller, KYu, Z Discovery of thieno[2,3-c]pyridines as potent COT inhibitors. Bioorg Med Chem Lett18:4952-5 (2008) 
 
Dual specificity mitogen-activated protein kinase kinase 1
Name:Dual specificity mitogen-activated protein kinase kinase 1
Type:Other Protein Type
Mol. Mass.:43439.03
Organism:Homo sapiens (Human)
Description:Full-length human MEK-1 was generated by PCR and purified as a fusion protein from Escherichia coli lysates.
Residue:393
BDBM50264738
NameBDBM50264738
Synonyms:4-(2'-chlorobiphenyl-4-yloxy)-2-(2H-tetrazol-5-yl)thieno[2,3-c]pyridine | CHEMBL491434
TypeSmall organic molecule
Emp. Form.C20H12ClN5OS
Mol. Mass.405.86
SMILESClc1ccccc1-c1ccc(Oc2cncc3sc(cc23)-c2nnn[nH]2)cc1