Reaction Details
TargetMitogen-activated protein kinase kinase kinase 8
LigandBDBM50265242
Substrate/Competitorn/a
Meas. Tech.ChEMBL_496717 (CHEMBL1005354)
IC50 1120±n/a nM
Citation George, DFriedman, MAllen, HArgiriadi, MBarberis, CBischoff, AClabbers, ACusack, KDixon, RFix-Stenzel, SGordon, TJanssen, BJia, YMoskey, MQuinn, CSalmeron, JAWishart, NWoller, KYu, Z Discovery of thieno[2,3-c]pyridines as potent COT inhibitors. Bioorg Med Chem Lett18:4952-5 (2008) 
 
Mitogen-activated protein kinase kinase kinase 8
Name:Mitogen-activated protein kinase kinase kinase 8
Type:Serine/threonine-protein kinase
Mol. Mass.:52916.89
Organism:Homo sapiens (Human)
Description:P41279
Residue:467
BDBM50265242
NameBDBM50265242
Synonyms:3-(4-(4-iodophenoxy)thieno[2,3-c]pyridin-2-yl)-1,2,4-oxadiazol-5(2H)-one | CHEMBL497151
TypeSmall organic molecule
Emp. Form.C15H8IN3O3S
Mol. Mass.437.212
SMILESIc1ccc(Oc2cncc3sc(cc23)-c2nc(=O)o[nH]2)cc1