Reaction Details
TargetEgl nine homolog 1
LigandBDBM50264177
Substrate/Competitorn/a
Meas. Tech.ChEMBL_535338 (CHEMBL983464)
IC50 400±n/a nM
Citation Frohn, MViswanadhan, VPickrell, AJGolden, JEMuller, KMBürli, RWBiddlecome, GYoder, SCRogers, NDao, JHHungate, RAllen, JR Structure-guided design of substituted aza-benzimidazoles as potent hypoxia inducible factor-1alpha prolyl hydroxylase-2 inhibitors. Bioorg Med Chem Lett18:5023-6 (2008) 
 
Egl nine homolog 1
Name:Egl nine homolog 1
Type:Protein
Mol. Mass.:46035.59
Organism:Homo sapiens (Human)
Description:Q9GZT9
Residue:426
BDBM50264177
NameBDBM50264177
Synonyms:2-(2-methyl-1-phenyl-1H-imidazo[4,5-c]pyridine-4-carboxamido)acetic acid | CHEMBL491425
TypeSmall organic molecule
Emp. Form.C16H14N4O3
Mol. Mass.310.3074
SMILESCc1nc2c(nccc2n1-c1ccccc1)C(=O)NCC(O)=O