Reaction Details
TargetHydroxycarboxylic acid receptor 2
LigandBDBM23515
Substrate/Competitorn/a
Meas. Tech.ChEMBL_535370 (CHEMBL983496)
IC50 130±n/a nM
Citation Deng, QFrie, JLMarley, DMBeresis, RTRen, NCai, TQTaggart, AKCheng, KCarballo-Jane, EWang, JTong, XWaters, MGTata, JRColletti, SL Molecular modeling aided design of nicotinic acid receptor GPR109A agonists. Bioorg Med Chem Lett18:4963-7 (2008) 
 
Hydroxycarboxylic acid receptor 2
Name:Hydroxycarboxylic acid receptor 2
Type:G Protein-Coupled Receptor (GPCR)
Mol. Mass.:41868.22
Organism:Homo sapiens (Human)
Description:Membranes from CHO cells expressing the recombinant human GPR109A were used in competition binding assay.
Residue:363
BDBM23515
NameBDBM23515
Synonyms:CHEMBL573 Nicotinic Acid pyridine-3-carboxylic acid | wampocap
TypeSmall organic molecule
Emp. Form.C6H5NO2
Mol. Mass.123.1094
SMILESOC(=O)c1cccnc1