Reaction Details
TargetHydroxycarboxylic acid receptor 2
LigandBDBM50264232
Substrate/Competitorn/a
Meas. Tech.ChEMBL_535373 (CHEMBL983499)
EC50 380±n/a nM
Citation Deng, QFrie, JLMarley, DMBeresis, RTRen, NCai, TQTaggart, AKCheng, KCarballo-Jane, EWang, JTong, XWaters, MGTata, JRColletti, SL Molecular modeling aided design of nicotinic acid receptor GPR109A agonists. Bioorg Med Chem Lett18:4963-7 (2008) 
 
Hydroxycarboxylic acid receptor 2
Name:Hydroxycarboxylic acid receptor 2
Type:G Protein-Coupled Receptor (GPCR)
Mol. Mass.:41868.22
Organism:Homo sapiens (Human)
Description:Membranes from CHO cells expressing the recombinant human GPR109A were used in competition binding assay.
Residue:363
BDBM50264232
NameBDBM50264232
Synonyms:2-(3-(6-hydroxynaphthalen-2-yl)propanamido)benzoic acid | CHEMBL522649
TypeSmall organic molecule
Emp. Form.C20H17NO4
Mol. Mass.335.3533
SMILESOC(=O)c1ccccc1NC(=O)CCc1ccc2cc(O)ccc2c1