Reaction Details
TargetTranscriptional activator protein LuxR
LigandBDBM50266165
Substrate/Competitorn/a
Meas. Tech.ChEMBL_543884 (CHEMBL1016859)
IC50 610±n/a nM
Citation Geske, GDMattmann, MEBlackwell, HE Evaluation of a focused library of N-aryl L-homoserine lactones reveals a new set of potent quorum sensing modulators. Bioorg Med Chem Lett18:5978-81 (2008) 
 
Transcriptional activator protein LuxR
Name:Transcriptional activator protein LuxR
Type:PROTEIN
Mol. Mass.:28527.37
Organism:Vibrio fischeri (strain ATCC 700601 / ES114)
Description:ChEMBL_543884
Residue:250
BDBM50266165
NameBDBM50266165
Synonyms:(S)-N-(2-oxotetrahydrofuran-3-yl)-2-(4-(trifluoromethyl)phenyl)acetamide | CHEMBL468624
TypeSmall organic molecule
Emp. Form.C13H12F3NO3
Mol. Mass.287.2345
SMILESFC(F)(F)c1ccc(CC(=O)N[C@H]2CCOC2=O)cc1