Reaction Details
TargetTranscriptional activator protein LuxR
LigandBDBM50265814
Substrate/Competitorn/a
Meas. Tech.ChEMBL_543884 (CHEMBL1016859)
IC50 2200±n/a nM
Citation Geske, GDMattmann, MEBlackwell, HE Evaluation of a focused library of N-aryl L-homoserine lactones reveals a new set of potent quorum sensing modulators. Bioorg Med Chem Lett18:5978-81 (2008) 
 
Transcriptional activator protein LuxR
Name:Transcriptional activator protein LuxR
Type:PROTEIN
Mol. Mass.:28527.37
Organism:Vibrio fischeri (strain ATCC 700601 / ES114)
Description:ChEMBL_543884
Residue:250
BDBM50265814
NameBDBM50265814
Synonyms:(S)-N-(2-oxotetrahydrofuran-3-yl)-3-(4-(trifluoromethyl)phenyl)propanamide | CHEMBL467396
TypeSmall organic molecule
Emp. Form.C14H14F3NO3
Mol. Mass.301.2611
SMILESFC(F)(F)c1ccc(CCC(=O)N[C@H]2CCOC2=O)cc1