Reaction Details
TargetSerine/threonine-protein kinase PLK1
LigandBDBM50263317
Substrate/Competitorn/a
Meas. Tech.ChEMBL_535435 (CHEMBL985261)
IC50 23±n/a nM
Citation Wang, HYCao, ZXLi, LLJiang, PDZhao, YLLuo, SDYang, LWei, YQYang, SY Pharmacophore modeling and virtual screening for designing potential PLK1 inhibitors. Bioorg Med Chem Lett18:4972-7 (2008) 
 
Serine/threonine-protein kinase PLK1
Name:Serine/threonine-protein kinase PLK1
Type:Serine/threonine-protein kinase
Mol. Mass.:68277.16
Organism:Homo sapiens (Human)
Description:P53350
Residue:603
BDBM50263317
NameBDBM50263317
Synonyms:(S)-allyl 2-cyano-2-(3-ethyl-4-oxo-5-((4-(3-(2-(pyrrolidin-1-yl)ethyl)ureido)phenylamino)methyl)thiazolidin-2-ylidene)acetate | CHEMBL477407
TypeSmall organic molecule
Emp. Form.C25H32N6O4S
Mol. Mass.512.624
SMILESCCN1C(=O)[C@H](CNc2ccc(NC(=O)NCCN3CCCC3)cc2)S\C1=C(\C#N)C(=O)OCC=C