Reaction Details
TargetSerine/threonine-protein kinase PLK1
LigandBDBM50263587
Substrate/Competitorn/a
Meas. Tech.ChEMBL_535435 (CHEMBL985261)
IC50 36±n/a nM
Citation Wang, HYCao, ZXLi, LLJiang, PDZhao, YLLuo, SDYang, LWei, YQYang, SY Pharmacophore modeling and virtual screening for designing potential PLK1 inhibitors. Bioorg Med Chem Lett18:4972-7 (2008) 
 
Serine/threonine-protein kinase PLK1
Name:Serine/threonine-protein kinase PLK1
Type:Serine/threonine-protein kinase
Mol. Mass.:68277.16
Organism:Homo sapiens (Human)
Description:P53350
Residue:603
BDBM50263587
NameBDBM50263587
Synonyms:CHEMBL477615 | propyl 2-cyano-2-(3-ethyl-5-((4-hydroxyphenylamino)methylene)-4-oxothiazolidin-2-ylidene)acetate
TypeSmall organic molecule
Emp. Form.C18H19N3O4S
Mol. Mass.373.426
SMILESCCCOC(=O)C(\C#N)=c1/s\c(=C\Nc2ccc(O)cc2)c(=O)n1CC