Reaction Details
TargetSerine/threonine-protein kinase PLK1
LigandBDBM8054
Substrate/Competitorn/a
Meas. Tech.ChEMBL_535435 (CHEMBL985261)
IC50 10000±n/a nM
Citation Wang, HYCao, ZXLi, LLJiang, PDZhao, YLLuo, SDYang, LWei, YQYang, SY Pharmacophore modeling and virtual screening for designing potential PLK1 inhibitors. Bioorg Med Chem Lett18:4972-7 (2008) 
 
Serine/threonine-protein kinase PLK1
Name:Serine/threonine-protein kinase PLK1
Type:Serine/threonine-protein kinase
Mol. Mass.:68277.16
Organism:Homo sapiens (Human)
Description:P53350
Residue:603
BDBM8054
NameBDBM8054
Synonyms:2-Anilino-4-(thiazol-5-yl)pyrimidine deriv. 25 4-[4-(4-Methyl-2-methylaminothiazol-5-yl)pyrimidin-2-ylamino]phenol CHEMBL47590
TypeSmall organic molecule
Emp. Form.C15H15N5OS
Mol. Mass.313.378
SMILESCNc1nc(C)c(s1)-c1ccnc(Nc2ccc(O)cc2)n1