Reaction Details
TargetCytochrome P450 11B2, mitochondrial
LigandBDBM8611
Substrate/Competitorn/a
Meas. Tech.ChEMBL_512775 (CHEMBL971586)
IC50 1±n/a nM
Citation Lucas, SHeim, RNegri, MAntes, IRies, CSchewe, KEBisi, AGobbi, SHartmann, RW Novel aldosterone synthase inhibitors with extended carbocyclic skeleton by a combined ligand-based and structure-based drug design approach. J Med Chem51:6138-49 (2008) 
 
Cytochrome P450 11B2, mitochondrial
Name:Cytochrome P450 11B2, mitochondrial
Type:Protein
Mol. Mass.:57582.15
Organism:Homo sapiens (Human)
Description:P19099
Residue:503
BDBM8611
NameBDBM8611
Synonyms:4-{5H,6H,7H,8H-imidazo[1,5-a]pyridin-5-yl}benzonitrile CHEMBL9298 US9271963, Fadrozole
TypeSmall organic molecule
Emp. Form.C14H13N3
Mol. Mass.223.2731
SMILESN#Cc1ccc(cc1)C1CCCc2cncn12