Reaction Details
TargetHistamine H3 receptor
LigandBDBM50263845
Substrate/Competitorn/a
Meas. Tech.ChEMBL_535494 (CHEMBL986121)
IC50 343±n/a nM
Citation Jitsuoka, MTsukahara, DIto, STanaka, TTakenaga, NTokita, SSato, N Synthesis and evaluation of a spiro-isobenzofuranone class of histamine H3 receptor inverse agonists. Bioorg Med Chem Lett18:5101-6 (2008) 
 
Histamine H3 receptor
Name:Histamine H3 receptor
Type:G Protein-Coupled Receptor (GPCR)
Mol. Mass.:48691.47
Organism:Homo sapiens (Human)
Description:Binding assays were using CHO cells stably expressing hH3R receptors.
Residue:445
BDBM50263845
NameBDBM50263845
Synonyms:CHEMBL490195 | N-methyl-4-(naphthalen-1-yl)-N-(2-(piperidin-1-yl)ethyl)piperidine-1-carboxamide
TypeSmall organic molecule
Emp. Form.C24H33N3O
Mol. Mass.379.5383
SMILESCN(CCN1CCCCC1)C(=O)N1CCC(CC1)c1cccc2ccccc12