Reaction Details
TargetHistamine H3 receptor
LigandBDBM50263897
Substrate/Competitorn/a
Meas. Tech.ChEMBL_535494 (CHEMBL986121)
IC50 393±n/a nM
Citation Jitsuoka, MTsukahara, DIto, STanaka, TTakenaga, NTokita, SSato, N Synthesis and evaluation of a spiro-isobenzofuranone class of histamine H3 receptor inverse agonists. Bioorg Med Chem Lett18:5101-6 (2008) 
 
Histamine H3 receptor
Name:Histamine H3 receptor
Type:G Protein-Coupled Receptor (GPCR)
Mol. Mass.:48691.47
Organism:Homo sapiens (Human)
Description:Binding assays were using CHO cells stably expressing hH3R receptors.
Residue:445
BDBM50263897
NameBDBM50263897
Synonyms:4-benzyl-N-methyl-N-(2-(piperidin-1-yl)ethyl)piperidine-1-carboxamide | CHEMBL489580
TypeSmall organic molecule
Emp. Form.C21H33N3O
Mol. Mass.343.5062
SMILESCN(CCN1CCCCC1)C(=O)N1CCC(Cc2ccccc2)CC1