Reaction Details
TargetHistamine H3 receptor
LigandBDBM50263952
Substrate/Competitorn/a
Meas. Tech.ChEMBL_535494 (CHEMBL986121)
IC50 297±n/a nM
Citation Jitsuoka, MTsukahara, DIto, STanaka, TTakenaga, NTokita, SSato, N Synthesis and evaluation of a spiro-isobenzofuranone class of histamine H3 receptor inverse agonists. Bioorg Med Chem Lett18:5101-6 (2008) 
 
Histamine H3 receptor
Name:Histamine H3 receptor
Type:G Protein-Coupled Receptor (GPCR)
Mol. Mass.:48691.47
Organism:Homo sapiens (Human)
Description:Binding assays were using CHO cells stably expressing hH3R receptors.
Residue:445
BDBM50263952
NameBDBM50263952
Synonyms:4-(3-chlorophenyl)-N-methyl-N-(2-(piperidin-1-yl)ethyl)piperazine-1-carboxamide | CHEMBL489590
TypeSmall organic molecule
Emp. Form.C19H29ClN4O
Mol. Mass.364.913
SMILESCN(CCN1CCCCC1)C(=O)N1CCN(CC1)c1cccc(Cl)c1