Reaction Details
TargetHistamine H3 receptor
LigandBDBM50264069
Substrate/Competitorn/a
Meas. Tech.ChEMBL_535494 (CHEMBL986121)
IC50 45±n/a nM
Citation Jitsuoka, MTsukahara, DIto, STanaka, TTakenaga, NTokita, SSato, N Synthesis and evaluation of a spiro-isobenzofuranone class of histamine H3 receptor inverse agonists. Bioorg Med Chem Lett18:5101-6 (2008) 
 
Histamine H3 receptor
Name:Histamine H3 receptor
Type:G Protein-Coupled Receptor (GPCR)
Mol. Mass.:48691.47
Organism:Homo sapiens (Human)
Description:Binding assays were using CHO cells stably expressing hH3R receptors.
Residue:445
BDBM50264069
NameBDBM50264069
Synonyms:CHEMBL491806 | N,2-dimethyl-3-oxo-N-[2-(piperidin-1-yl)ethyl]-2,3-dihydrospiro[isoindole-1,4'-piperidine]-1'-carboxamide
TypeSmall organic molecule
Emp. Form.C22H32N4O2
Mol. Mass.384.5151
SMILESCN(CCN1CCCCC1)C(=O)N1CCC2(CC1)N(C)C(=O)c1ccccc21